C 2146 Error

Pursuant to the Trustee Act 1925 any persons having a claim against or an interest in the Estate of the.

RECOMMENDED: If you have Windows errors then we strongly recommend that you download and run this (Windows) Repair Tool.

Pursuant to the Trustee Act 1925 any persons having a claim against or an interest in the Estate of the above named, late of 39 Ingram Road, CR7 8EE, who died on 24/01/2017 are required to send written particulars thereof to the.

Mac Terminal Error -9999 0 Feb 01, 2010  · MAC and expired Terminal Server Client. (Terminal Services) 0 2. time when someone logs on from this

Note: C++ does not support default-int 1>C:DevLibsCppboost_1_49_0boost/ thread/xtime.hpp(41): error C2146: syntax error : missing '.

Pursuant to the Trustee Act 1925 anyone having a claim against or an interest in the Estate of the deceased, late of Limes Avenue, Waddon, Croydon, CRQ 4JX, who died on 24/07/2017, must send written particulars to the address below by.

Error 3 error C2664: 'ftpparse' : cannot convert parameter 2 from 'wxChar *' to. d :wxCURLincludecurl/curl.h(170) : error C2146: syntax error.

Jan 8, 2015. ClassesPrisoner.cpp) f:documentsappsprisonbreakclassesplayscene.h 35 1 PrisonBreak > Error 10 error C2146: syntax error : missing.

Aug 24, 2013  · Causes of Medication Administration Errors in Hospitals: a Systematic Review of Quantitative and Qualitative Evidence

The Council have made an Order to close that part of C2146 Broad Alley, Cutnall Green, from its junction with A442.

src/event/ngx_event_openssl.c:1960: error:. of function ' EVP_MD_CTX_cleanup' src/event/ngx_event_openssl.c:2146: error: unused variable 'md' make[1]:.

TRAFFIC on Wakehurst Parkway north of Seaforth will be disrupted for a month from next Thursday while geotechnical work is undertaken as part of planning for the Western Harbour Tunnel Beaches Link project. The work will take place.

Missing type specifier in the declaration of the identifier. This error may be caused by a typographical error. Error C2065 usually precedes this error. This error.

Nov 08, 2010  · NOTA: Yo no nice el video, lo recibí por e-mail y me pareció gracioso y quise compartirlo. Todos los comentarios agregados al video tampoco son obra mía.

Index Note that this statute has been revised in virtually every legislative session since it was first passed over 40 years ago. Please check the latest version.

State Farm Agent Randy Wiggins in Alexandria, LA – We offer Auto, Home, Life, and Renters insurance. Call us at (318) 445-6566 to learn more.

Pursuant to the Trustee Act 1925 any persons having a claim against or an interest in the Estate of the above named, late of Room 407 Landsdowne Hotel, 1 Lansdowne Road, Croydon, Surrey CR9 2BN, who died on 26/02/2017, are required.

Most instances of the Canadian health-care system hurting rather than healing patients are not even reported by staff internally, a Post investigation has found

May 15, 2017  · Hi, Please login to the Hyper-V computer locally, and then try to create a VHD using the following script to see whether you get the same issue.

Please help to figure out whats wrong with this code. main.cpp create Object3D which create Box and pass Object3D* pointer to Box. And there are errors until i remove.

Wireshark · Wireshark-dev: [Wireshark-dev] Building latest. – Dec 22, 2016. steps: —– cd C:UsersASDocumentsProjectsWiresharkSource git. as an expression -> packet-ipv6.c(2105): error C2146: syntax error.

I would usually search for this error. But in VS C++ Express, this error comes up for just about every mistake you do. Any how I recieve this error below error C2146.

RECOMMENDED: Click here to fix Windows errors and improve system performance

This article was written by Antwan