Error C1004 Visual Studio

179 thoughts on “ Using C# from native C++ with the help of C++/CLI (fixed and enhanced) ” Re: fatal.

Extension(1) Lesson 1: C++ Build Errors

RECOMMENDED: If you have Windows errors then we strongly recommend that you download and run this (Windows) Repair Tool.

179 thoughts on “ Using C# from native C++ with the help of C++/CLI (fixed and enhanced) ”

Re: fatal error C1075: end of file found before the left brace '{'. Posted 13 September 2009 – 10:23 AM. Alternatively create a new project with visual studio. Although it compiles, I don't particularly care for the way you've gone about it. You create object instances, but then use a static accessor. That doesn't.

I want to write a simple C++ code in visual studio 2012 but always getting a error C1004 in the header file. Could anyone please help me? My code is given below. I am.

Dealing with Troubleshoot for Common Visual Studio Error C1004 There are actually situations that you'll experience computer error. Those who doesn't have.

#9986 (boost/thread/future.hpp) – Boost C++ Libraries – See documentation on how to use Visual C++ 'Checked Iterators' 1> c:Program Files (x86)Microsoft Visual Studio 9.0VCincludexutility(2703) : see. error C2143: syntax error : missing ';' before '}' 1>C:depotExtLibsboost_Installers boost_1_49includeboost/thread/future.hpp(251) : fatal error C1004: unexpected.

I’m trying to reference a web service on a NAV 2017 instance hosted in AZURE, from a new C# test project in Visual Studio on a local server. but still results in a 401 error after 3 entries of correct credentials. The above test on the.

1 мар 2016. Рассмотрим подготовку и использование этой библиотеки в средах Visual Studio 2014 и 2015. К счастью в новых сборках OpenCV. f:visual studio 2015 projectsconsoleapplication5consoleapplication5main.cpp(24): fatal error C1004: unexpected end-of-file found вот такая ошибка в 24 строке.

that fixed the remaining errors thank you.the problem originated I think when I removed an included header file from the source file(game.cpp), the.

class/struct/union – C++ Forum – Cplusplus.com – 1>c:usersjoshdocumentsvisual studio 2010projectsassignment 2assignment 2assignment 2.cpp(18): error C2228: left of '.count' must have class/struct/union 1> type is 'int' 1>c:usersjoshdocumentsvisual studio 2010projectsassignment 2assignment 2assignment 2.cpp(56): error C2079: 'cust1'.

I'm trying to write a class in C++, but whenever I try to compile, it fails with this error: "fatal error C1004: unexpected end-of-file found" I'm using VS2010.

Hostexplorer Error HostExplorer® Programmer's Guide ii HostExplorer Programmer's. Host Explorer Programming. This read-only property returns the error status for the last. HostExplorer

Nov 27, 2014. INCLUDEobjidl.h(6624) : fatal error C1004: unexpected end of file found. This header is actually part of the VC++ headers provided by Visual Studio/Windows SDK, so it's odd that Visual Studio was complaining about it. After a lot of Googling I came across a Spanish post about the same problem:.

When you build a project with Visual Studio, Visual Studio generates a package manifest. project target a different specific architecture than the app package, a build error is thrown, and you must change the target architecture of.

Microsoft has released a preview version of SQL Operations Studio, their new cross platform database development tool. The new tool was forked from Microsoft’s successful cross platform code editor, Visual Studio. and error.

This build works in conjunction with previously released SDKs and Visual Studio 2017. You can install this SDK and. it will generate a build failure indicating a.

Raima Data Manager System Error Java security – “We greatly regret this error and we apologize to all Mac users.” Apple said it’s auditing its

We are excited to introduce the integration of HDInsight PySpark into Visual Studio Code (VSCode), which allows developers. such as IntelliSense auto-suggest, autocomplete, and error marker, among others. Preview and export.

Fatal Error C1004. Fatal Error C1004. Fatal Error C999. Fatal Error C1001. Fatal Error C1002. Fatal Error C1003. Visual Studio 6.0 unexpected end of file found.

Download the Latest Version of Visual Studio at the Official Microsoft® Store.

2017-11-17T14:43:19.6093568Z ##[error]Error: Machine Specifications Visual Studio Test Adapter – Error while executing specifications in assembly.

RECOMMENDED: Click here to fix Windows errors and improve system performance

This article was written by Antwan