Error C2061 In

WWW.GERMANWARBOOTY.COM Archives Page: The items in this section are no longer available but this section has been created as a.

RECOMMENDED: If you have Windows errors then we strongly recommend that you download and run this (Windows) Repair Tool.

WWW.GERMANWARBOOTY.COM Archives Page: The items in this section are no longer available but this section has been created as a reference for fellow collectors.

[2017.06.24-15.05.03:451][767]UATHelper: Packaging (Windows (64-bit)): UnrealBuildTool: ERROR: UBT ERROR: Failed to produce item:.

Trapping errors and providing helpful feedback are a number of those mundane tasks which the developer must, sooner rather than later, come to terms with.

Not sure if in Visual_Basic works like this, but in Borland C++ Builder worked just fine. void __fastcall TForm1::Button3Click(TObject *Sender).

Jan 3, 2017. C:Program Files (x86)Windows Kits10include10.0.10240.0ucrtinttypes.h(26): error C2061: syntax error: identifier 'intmax_t'. I finally decided.

Frmcache.dat Error TechRepublic reader SMWright offered this suggestion: “If you are using Microsoft Outlook 2000, take a look at Microsoft’s Knowledge Base

I try to reference a struct from another class in my code and it gives me an error, saying I have a syntax problem. #pragma once #include "Definitions.h" #include "GV.

closed as too localized by Bo Persson, joce, phs, teppic, Greg Bacon Mar 31 '13 at 1:55. This question is unlikely to help any future visitors; it is only relevant to.

Top 3 Registry Cleaners | Editors-Top-Choice.com – Most Registry Cleaner Softwares Failed Our Test, See Which Passed !

Hi Pavel, Thank you for acknowledging my Windows port of MPFR. I run all the mpfr C++ wrappers and I tried yours out today. The only problem I had is that you don’t.

NOTICE is hereby given that Worcestershire County Council has made an Order under Section 16A of the Road Traffic Regulation Act 1984 to facilitate the holding of the Velo Birmingham Cycle Sportive event through Worcestershire on 24.

With <atldbgmem.h> included in stdafx.h (precompiled header), compiler says error: 1>d:boostboost_1_48_0boostoptionaloptional.hpp(346): error C2061:.

LNK2019: unresolved external symbol _main referenced. – I have the following error LNK2019: unresolved external symbol _main referenced in function ___tmainCRTStartup, There are a lot of threads relating to this error but.

Tag: error C2061: syntax error : identifier 'SOCKET'. Common Errors and Resolutions for Building your own MySQL or MariaDB C/C++ Program on Windows.

High-Resolution Respirometry: OXPHOS Protocols for Human Cells and Permeabilized Fibers from Small Biopsies of Human Muscle

Error 3314 Ms Access You can now report a problem or send feedback about your Skype for Business experience directly to Microsoft, right from

Feb 25, 2003  · As soon as I modify my stdafx.h to define _WIN32_WINNT as 0x0501 (WinXP) instead of 0x0400 (Win2000) I get the following errors when I.

The compiler found an identifier where it wasn't expected. Make sure that identifier is declared before you use it. An initializer may be enclosed by parentheses. To.

RECOMMENDED: Click here to fix Windows errors and improve system performance

This article was written by Antwan