Error C2679 Visual Studio

Urban Dictionary: C++ – What does: ".srcCont.cpp(52) : error C2679: binary '=' : no operator found which takes a right-hand.

C++ recap on if, else, string, and char

RECOMMENDED: If you have Windows errors then we strongly recommend that you download and run this (Windows) Repair Tool.

Urban Dictionary: C++ – What does: ".srcCont.cpp(52) : error C2679: binary '=' : no operator found which takes a right-hand operand of type 'int' (or there is no acceptable conversion) C: Program FilesMicrosoft Visual Studio 8VCincludevector(392): could be 'std::_ Vector_iterator<_Ty, _Alloc> &std::_Vector_iterator<_Ty, _Alloc>::operator =( const.

Get Great Deals on Visual Studio. Download Now At The Official Microsoft® Store.

Attempting to cut or copy small to moderate amounts of text in Visual Studio 2010 RTM (Release to Manufacturing) may incorrectly cause the following error: ‘Insufficient available memory to meet the expected demands of an operation at.

Jun 19, 2010  · Basically, I need to know if I can have a one-dimensional array as a value type in a map. Here’s some basic code that kind of resembles what I’m doing:

Hi Everyone, I'm totally new to programming, but I'm trying to learn. I thought I would reach out to the experts out in the community. When I compile an.

binary '<<' : no operator found which takes a right-hand operand of type. Browse other questions tagged c++ visual-studio-2012 c++11 or ask your own. Error.

UPDATES Feb 20, 2013: In response to a question by student Hala Abuhasna if you wish to use the.NET Serial class, use the naming convention.

The Xamarin Live Player already supports breakpoints when debugging, and we’ve improved how the overall functionality integrates into Visual Studio in this.

This guide will also be maintained on my blog http://techbitar.blogspot.com/2012/04/face-detection-and-tracking-with.html INTRODUCTION In this project I have.

Itunes An Unknown Error Occurred 42110 An unknown error occurred. I'm connected to the internet and have the latest version of iTunes installed.Please help. 1671 error

The articles in this section of the documentation explain a subset of the error messages that are generated by the compiler. The Visual Studio compilers and build.

When you build a project with Visual Studio, Visual Studio generates a package manifest. project target a different specific architecture than the app package, a build error is thrown, and you must change the target architecture of the.

The new home for Visual Studio documentation is Visual Studio 2017 Documentation on docs.microsoft.com. The latest version of this topic can be found at Compiler.

-permissive- (Standards conformance) | Microsoft Docs – Specify standards conformance mode to the compiler. Use this option to help you identify and fix conformance issues in your code, to make it both more correct and.

Read the Section 02 of the instructions to get it work. Once I do that I got an error message, and I could not resolve it. (Could not download symbols. Please see the Visual Studio output log for more details) In my local installation, I use.

I was trying to use filesystem::recursive_directory_iterator to go through all the files in a directory, recursively, and I noticed that the Visual C++ implementation.

Sep 21, 2017  · Download Visual Studio 2003 Retired Technical documentation from Official Microsoft Download Center

This sometimes results in a situation where the trained neural network model predicts the output values for the training data very well, with little error and high.

This build works in conjunction with previously released SDKs and Visual Studio 2017. You can install this SDK and. it will generate a build failure indicating a.

Jun 13, 2010. library path : C:Program FilesMicrosoft Visual Studio 9.0VClib put the glut32.lib into above directory. Note on VS2003. C:/Program Files/Codeblocks/mingw/ include/gl/glut.h:47: error: redeclaration of C++ built-in type 'short'. mingw32- make:. error C2679: binary '>>' : no operator found. (VS2008)In.

Please don't confuse with the title as it was already asked by someone but for a different context The below code in Visual C++ Compiler (VS2008) does not get.

Visual Studio: Error C2679 – C++ Forum – Visual Studio: Error C2679. jdm1891. I am making a function that holds a vector of references. When I try to cout the references: int works fine, but if I output std.

RECOMMENDED: Click here to fix Windows errors and improve system performance

This article was written by Antwan