Error Expected Specifier-qualifier-list Before In C

Sp Estimate Data Compression Savings Error When some factors are harder to vary than others, a split plot design can.

Neural Net in C++ Tutorial on Vimeo

RECOMMENDED: If you have Windows errors then we strongly recommend that you download and run this (Windows) Repair Tool.

Sp Estimate Data Compression Savings Error When some factors are harder to vary than others, a split plot design can be efficient. Figure 2: In biological

expected specifier-qualifier-list in C. 1. Expected Specifier Qualifier List error inside struct. 0. expected specifier-qualifier-list before 'typedef'.

Oct 8, 2010. You used confType before you declared it. (for next). Instead, try this: typedef struct confType { char *key; long canTag; long canSet; long allowMultiple; struct confType *next; } confType;.

Error 1067: The Process terminated unexpectedly." Error 1067 when you try to start the SSHD service If you look in the C:WindowsSystem32OpenSSHLogs.

Apr 22, 2014. include/sysinc.h:298, from./././include/common.h:23, from md5.c:54: /usr/include /net/route.h:310: error: expected specifier-qualifier-list before 'eye_catch8b_t' make: The error code from the last command is 1. Stop. make: The error code from the last command is 1. Stop. make: The error code from the last.

Microchip USB libraries use attribute ((packed)) in structures. XC16 does not like it, a typical warning message looks as follows: usb_hal_pic24.h:296:13: warning.

expected specifier-qualifier-list before 'pthread_t. It would also help if you could post a small example of a C file that shows the error when compiled.

Jan 30, 2013. common/utils.c -o./common/utils.o In file included from./././././include/GL/ internal/dri_interface.h:51, from./common/utils.h:32, from./common/utils.c:37: / usr/local/include/libdrm/drm.h:612: error: expected specifier-qualifier-list before ' __u64' /usr/local/include/libdrm/drm.h:617: error: expected.

Jan 25, 2016. from /home/alaing/INTEL/dpdk-2.2.0/lib/librte_vhost/virtio-net.c:35: /usr/include/ linux/virtio_net.h:171: error: expected specifier-qualifier-list before 'u16' make[4]: *** [virtio-net.o] Error 1 make[3]: *** [librte_vhost] Error 2 make[2]: *** [lib] Error 2 make[1]: *** [all] Error 2 make: *** [all] Error 2 I bypassed VIRTIO.

Ole Miss – OXFORD — Ole Miss received contributions from both expected and. (Photo: AP) An academic error forced Wilkins to sit out the entire 2016 season, which was.

Now, it is expected to happen in coming days. Now, keep in mind, a year and a half before the FBI had serious evidence of Russian bribery linked to the.

actually, I had an #include "parser.h" in the catalog.h. I removed it, and now it compiles normally. I guess it tried to load parse_query definition before the.

this error basically comes when you use. "expected specifier-qualifier-list before '*' token" error in. Error expected primary expression before '.

I am trying to make two linked lists. My nodes are defined as follows: Code: typedef struct{ char *message; int msglength; pthread_t sender; mail *nex

The Washington Post-Schar School poll, which gave Jones a narrow lead that is.

I am trying to port a project from ppc405 to ppc440. I was previously using EDK 9.1 and am currently using 10.1. When i try to compile the code I get this error. C:/ XilinxProj/ppc440_0/include/sys/ktypes.h:94: error: expected specifier-qualifier- list before 'pthread_t'. I am using. OS option as XilKernel.

Before we start setting up our web app. The leftmost directory in this video is.

2008-04-13 20:30:01 error: expected specifier-qualifier-list before '__kernel_old_dev_t' zhi shaolong (CHINA) Message: 54160 i installed

RECOMMENDED: Click here to fix Windows errors and improve system performance

This article was written by Antwan