Error While Loading Shared Libraries Libselinux.so.1

SLES 11 SP3 System Analysis and Tuning Guide – SUSE – SUSE Linux Enterprise Server is used for a broad.

Error While Loading Shared Libraries Fix - Ubuntu 10.10

RECOMMENDED: If you have Windows errors then we strongly recommend that you download and run this (Windows) Repair Tool.

SLES 11 SP3 System Analysis and Tuning Guide – SUSE – SUSE Linux Enterprise Server is used for a broad range of usage scenarios in enterprise and scientific data centers. SUSE has ensured SUSE Linux Enterprise Server is.

Sep 3, 2011. 1. tonidosyncstart.sh command does not appear to do anything. error while loading shared libraries: libnotify.so.1: cannot open shared object file: No such file or. libselinux.so.1 => /lib32/libselinux.so.1 (0xf580f000)

Error Opening Serial Port Dev Ttyusb1 Ham Radio Software on Centos Linux – Configuring multitudes of Amateur / HAM Radio software for Centos6 / Centos5 Linux

Resolve error while loading shared libraries: libselinux.so.1. – When i was trying to execute a binary in ubuntu 14.04 LTS, I got this error: error while loading shared libraries: libselinux.so.1: cannot open shared object file: No.

utserver: error while loading shared libraries: libssl.so.0.9.8: cannot open shared object file: No such file or. libselinux.so.1. libsysfs.so.2.0.1.

While executing a 3rd party c++ program I get the following error: error while loading shared libraries:. libselinux.so.1. error while loading shared libraries.

. error while loading shared libraries: libselinux.so.1: cannot open shared object file:. AR# 61323 2014.2 PetaLinux – error while loading shared libraries:.

May 17, 2012. Try export LD_LIBRARY_PATH=/tmp/chroot/lib /tmp/chroot/lib/ld-linux-x86-64.so. 2 /bin/ls.

Ssl Error 61 Safari Safari – "Safari can't verify the identity of the website". The SSL certificate on that website expired and currently the

I am getting the following error every time when i try to use an svn command from. svnadmin: error while loading shared libraries: libsvn_repos-1.so.0: cannot. libselinux.so.1 => /lib64/libselinux.so.1 (0x00002b3bf5161000)

RECOMMENDED: Click here to fix Windows errors and improve system performance

This article was written by Antwan