Sub Process /usr/bin/dpkg Returned An Error Code 1 Ubuntu

I’ve seen this message several times whenever someone has a problem installing, upgrading or removing some piece of software, but.

solucion del error usr/bin/dpkg returned an code (1)

RECOMMENDED: If you have Windows errors then we strongly recommend that you download and run this (Windows) Repair Tool.

I’ve seen this message several times whenever someone has a problem installing, upgrading or removing some piece of software, but I wonder, what does it mean, and.

I am stuck in the recovery console due to a previous error. Because of this error I am required to update/reinstall my packages. However, when I.

Bad Astronomy: Misconceptions and Misuses Revealed, from Astrology to the Moon Landing "Hoax" – This is the dreaded "Error Code -36" message, which I assume Apple stole from Microsoft because it is a generic message which tells you nothing. Anyway, I searched high and low on the web for some way to fix this, but nothing.

Sub-process /usr/bin/dpkg returned an error code (1) Kodi.

Google Chrome Error 118 Connection Timed Out Jan 9, 2014. There is no repair tool, you should remove Google Chrome and install Google Chrome Canary: https://www.google.com/chrome/browser/canary.html. 2

dpkg: error processing mariadb-server-10.0 (–configure):. subprocess installed post-installation script returned error exit status 1. dpkg: dependency problems prevent configuration of mariadb-server:. while processing: mariadb-server- 10.0. mariadb-server. E: Sub-process /usr/bin/dpkg returned an error code (1).

May 28, 2014. I managed to fix this problem by reading the error message and seeing that: DbDriver "config": /var/cache/debconf/config.dat is locked by another process: Resource temporarily unavailable. In order to remove the lock from this file I did this: sudo fuser -v /var/cache/debconf/config.dat. Then after doing this I.

You can post the Portuguese error message or run the command as LANG=C sudo apt-get remove webcontentcontrol that will give you the error message in English. You can also try sudo dpkg-configure -a just in case, but knowing the error message will tell us what we need to help. By the way, if you're embarassed by.

Extern C Error Lnk2005 Error 8904 HEDS-8904 Broadcom Limited | Sensors, Transducers | DigiKey – Order Broadcom Limited HEDS-8904 (516-2404-ND) at DigiKey. Check stock

Mar 06, 2013  · . Ign http://security.ubuntu.com karmic. Sub-process /usr/bin/dpkg returned an error code (1) PDA. Sub-process /usr/bin/dpkg returned an error.

. 28: /var/lib/dpkg/info/odoo.postinst: update-python-modules: not found. dpkg: error processing package odoo (–configure):. subprocess installed post- installation script returned error exit status 127. Errors were encountered while processing: odoo. E: Sub-process /usr/bin/dpkg returned an error code (1).

Nokia N900 owners are now the envy of the mobile world having been given the privilege of being the first group of people to use the official finalized version of Firefox Mobile. Firefox Mobile will run on the Maemo 5 platform and incorporates.

Hacking: The Next Generation by Nitesh Dhanjani, Billy Rios, and Brett Hardin Copyright © 2009 Nitesh Dhanjani. All rights reserved. Printed in the United States of America. Published by O’Reilly Media, Inc., 1005 Gravenstein Highway.

Kindly advise I was updating my chrome version on ubuntu 16, Sub-process /usr/bin/dpkg returned an. Sub-process /usr/bin/dpkg returned an error code (1).

Cant boot – hdd error – Linux Mint Forums – Welcome to the Linux Mint forums!. 197071&p=1022603&hilit=%2Fusr%2Fbin%2Fdpkg+returned+an+error+code+2+#. Sub-process gzip returned an error code (1) E:.

once i try one of them i get the message : "sub-process /usr/bin/dpkg returned. error code (100)" I have tried all solutions that i have found on the web but nothing is helping. Pls help and do not ask me to restore , it’s impossible i.

Here is One Fix For E: Sub-process /usr/bin/dpkg returned an error code (1) Error Which Makes APT To Fail to Update Packages on Ubuntu 16.04.

habe seit kurzem ein Problem bei dem aktualisieren von Ubuntu. Sub-process /usr/bin/dpkg returned an error. 2Fusr%2Fbin%2Fdpkg+error+code+ 1#.

Mar 21, 2011  · . I am using Ubuntu 9.10. Sub-process /usr/bin/dpkg returned an error code (1) PDA. View Full Version : [ubuntu] E: Sub-process /usr/bin/dpkg returned an error.

dpkg: error al procesar el paquete nvidia-legacy-304xx-driver (–configure): problemas de dependencias. Sub-process /usr/bin/dpkg returned an error code (1).

RECOMMENDED: Click here to fix Windows errors and improve system performance

This article was written by Antwan