Uncaught Exception 601 Parser Error Unexpected

Bugs Patterns. The complete list of descriptions given when FindBugs identify potential weaknesses. Apr 21, 2012. You have severe issues.

RECOMMENDED: If you have Windows errors then we strongly recommend that you download and run this (Windows) Repair Tool.

Bugs Patterns. The complete list of descriptions given when FindBugs identify potential weaknesses.

Apr 21, 2012. You have severe issues with your code handling Graph API response and construction of FQL query: $facebook->api('/me/friends') returns.

Sep 27, 2011  · OLE_E_FIRST – 0x80040000 – (0) winerror.h. OLE_E_OLEVERB – 0x80040000 – (0) winerror.h Invalid OLEVERB structure. OLE_S_FIRST – 0x00040000 -.

Feb 18, 2014. catch (FacebookApiException $e) {. Fatal error: Uncaught Exception: 601: Parser error: unexpected '-' at position 129. thrown in.

Psn Error 8002ad3d If your question is not answered here, please make a thread containing your error and details about it. Quicklinks: How

Dec 28, 2015. Plugin could not be activated because it triggered a fatal error. Parse error: syntax error, unexpected 'new' (T_NEW) in.

Gimpel Software’s PC-lint and FlexeLint On-Line Demos. On-Line Message Reference for FlexeLint and PC-lint (aka FlexeLint for Windows)

I have a FB app script and im trying to make it work but I get this error: Fatal error: Uncaught Exception: 601: Parser error: unexpected ')' at position 37. thrown.

Facebook Connect Tutorial, new version – Barattalo – I am using your code for facebook connect but it is showing following error Fatal error: Uncaught OAuthException: (#601) Parser error: unexpected '.' at position.

Home > uncaught exception > uncaught exception 601 parser error unexpected Uncaught Exception 601 Parser Error Unexpected. here for a quick overview of the site Help.

Error 500 al intentar acceder al detalle de los productos, y fallo de. – [24-Apr-2015 13:53:07 UTC] PHP Parse error: syntax error, unexpected 'array'. [03-May-2015 20:46:21 Europe/Madrid] PHP Fatal error: Uncaught exception.

Cobol File Status Error Community Help – File Status 39 – Cobol file status code lookup and help- What others experienced COBOL File Status

Uncaught SyntaxError: Unexpected token with JSON.parse. Ask Question. The reason for the error is that JSON.parse() expects a String value and products is an Array.

Compile Error In Hidden Module Winapi Each time I open a document in Word, I get an error message reading "Compile Error in hidden module: WinFaxPrintAndMerge."

Our Q4 market share of the 601+cc market was up 2.0 percentage points. Overall, international retail sales were quite strong with the exception of three markets; Brazil, India and Indonesia. Excluding these three markets, international.

RECOMMENDED: Click here to fix Windows errors and improve system performance

This article was written by Antwan