Error Implicit Declaration Of Function Sb_alloc_coherent

The results suggest that a function. eliciting implicit learning (Destrebecqz and Cleeremans, 2001). RTs for. linux-next: build failure after merge.

RECOMMENDED: If you have Windows errors then we strongly recommend that you download and run this (Windows) Repair Tool.

The results suggest that a function. eliciting implicit learning (Destrebecqz and Cleeremans, 2001). RTs for.

linux-next: build failure after merge of the pm tree: Hi Rafael, error: implicit declaration of function 'ERR_PTR' [-Werror=implicit-function-declaration]

When Option Strict is set to On, "Implicit type; object assumed" is set to Error. One final point: Option Strict = On implies variable declarations, so if Option Strict is On, so is Option Explicit. The chief hazard of skipping type.

Mar 6, 2013. You have to declare the functions before you use them: int computeShort(); // declaration here int main() { computeShort(); } int computeShort().

implicit declaration of function 'xcalloc'. even though it's in memory. – Apr 16, 2014. c.o [ 2%] Building C object src/CMakeFiles/nvim.dir/os/fs.c.o /Users/nwhite/ neovim.git/src/os/fs.c:92:17: error: implicit declaration of function.

Commits · FireLord1/android_kernel_motorola_msm8916 · GitHub –. error: implicit declaration of function 'dma. implicit declaration of function 'dma_free_coherent. implicit declaration of function 'dma_alloc.

Sep 9, 2014. The error is because you are not including explicitly the header that declares the function and the compiler is 'including' implicitily for you and.

Alternatives for usb_pipe_endpoint in. error: implicit declaration of function 'usb_pipe_endpoint' /home. usb_alloc_coherent with usb_buffer_alloc and.

2635 Error 161 This article provides resolution to the errors: "The server certificate received is not trusted (SSL Error 61)", "Your app is

. error: implicit declaration of function 'dma_alloc_coherent': => 19. error: implicit declaration of function 'dma_set_coherent_mask': => 112

In this post/video, you’ll learn how Arrow Functions both make your code more concise while also making the "this" keyword more manageable. You’ll also learn.

multi_v7_defconfig) produced this warning: lib/cpumask.c: In function ‘cpumask_next_and’: lib/cpumask.c:39:9: error: implicit declaration of function ‘find_next_and_bit’ [-Werror=implicit-function-declaration]

I am finding following implicit declaration issue. error: implicit declaration of function. implicit declaration of function 'usb_buffer_alloc' /home/Research.

Error Java.sql.sqlexception Before Start Of Result Set java.sql.SQLException: Before start of result set at com.mysql.jdbc. ResultSet exception – before start of result set. 227. Error: Before start

error: implicit declaration of function 'usb_buffer_alloc' カーネル 2.6.34 で、 usb_buffer_alloc は usb_alloc_coherent.

c – How do i fix this error? warning: implicit declaration of function. – Mar 29, 2012. Is the definition of main_menu() is after add_birthday() ? If yes define main_menu () before add_birthday(). Also define all the methods before.

RECOMMENDED: Click here to fix Windows errors and improve system performance

This article was written by Antwan