Error In Sitecustomize Set Pythonverbose For Traceback

Error in sitecustomize; set PYTHONVERBOSE for traceback: AttributeError: module 'pkg_resources' has no attribute 'DistributionNotFound' Traceback (most recent call last): File.

RECOMMENDED: If you have Windows errors then we strongly recommend that you download and run this (Windows) Repair Tool.

Error in sitecustomize; set PYTHONVERBOSE for traceback: AttributeError: module 'pkg_resources' has no attribute 'DistributionNotFound' Traceback (most recent call last): File "/home/ubuntu/anaconda3/lib/python3.5/site‑packages/path.py", line 123.

Aug 22, 2015. Error in sitecustomize; set PYTHONVERBOSE for traceback: TypeError: ' NoneType' object is not callable Traceback (most recent call last): File.

.for traceback: KeyError: 'sitecustomize'请下载安装最新版的"eclipse下开发python的插件"PyDev 2.7.1.exe就可以解决这个问题了! 2013-04-16 eclipse +pydev+python3.3 新建工程,. 2013-12-26 你好打扰了 python设置 PYTHONVERBOSE变量.

Spyder with Anaconda 4.0 fails to start IPython terminal · Issue #751. – Apr 13, 2016. An error ocurred while starting the kernel Error in sitecustomize; set PYTHONVERBOSE for traceback: AttributeError: module 'pkg_resources'.

Error in sitecustomize; set PYTHONVERBOSE for traceback: AttributeError: module ‘sys’ has no attribute ‘setdefaultencoding’ Traceback (most recent call last):

Sep 7, 2016. PYTHONPATH, PYTHONVERBOSE and other infuriations. Error in sitecustomize; set PYTHONVERBOSE for traceback: KeyError:.

Gethostbyaddr Error Dns Error 1 Sep 8, 2012. Your code doesn't compile for me. I get errors on in_addr and hostent. But if I change
Javax.el.elexception Error Reading Result List PrimeFaces CRUD Generator for NetBeans / Discussion. – Apr 5, 2015. javax.el.ELException: Error reading 'items' on type. /WEB-INF/include/view/ login/List.xhtml at

Eclipse Python Error in sitecustomize; set PYTHONVERBOSE. – Eclipse Python Error in sitecustomize; set PYTHONVERBOSE for traceback: (Python) – Codedump.io

GitHub is home to over 20 million developers working together to. set PYTHONVERBOSE for traceback:. “`Error in sitecustomize; set PYTHONVERBOSE for.

Error in sitecustomize; set PYTHONVERBOSE for traceback: AttributeError: module ‘sys’ has no attribute ‘setdefaultencoding’ Traceback (most recent call last):

fix for python3 error when running python’s 2 sitecustomize #16848. set PYTHONVERBOSE for traceback:. Error in sitecustomize; set PYTHONVERBOSE.

Error in sitecustomize; set PYTHONVERBOSE for traceback Traceback (most recent call last): File "/Users/libbyh/anaconda3/bin/jupyter-notebook", line 4, in <module>. import notebook.notebookapp.

Oct 26, 2012. The error is the same that is displayed when I try to open it on the terminal: Error in sitecustomize; set PYTHONVERBOSE for traceback:.

Brand new to python, running it in eclipse. Running the following code. print("Hello, World!") I received this error: Error in sitecustomize; set PYTHONVERBOSE for traceback: KeyError: 'sitecustomize' Hello, World!

Set the PYTHONVERBOSE environment variable as suggested by the. full traceback, which should tell you what file that error is coming from.

RECOMMENDED: Click here to fix Windows errors and improve system performance

This article was written by Antwan