Gcc Fatal Error No Input Files Compilation Terminated

Error Code Unspecified Error And here’s the error code from the specification. with the Internet of Things. May 11, 2017.

fatal error no such file or directory code blocks

RECOMMENDED: If you have Windows errors then we strongly recommend that you download and run this (Windows) Repair Tool.

Error Code Unspecified Error And here’s the error code from the specification. with the Internet of Things. May 11, 2017  · SCCM 2012 error codes

Ham Radio Software on Centos Linux – Configuring multitudes of Amateur / HAM Radio software for Centos6 / Centos5 Linux

Java SE Development Kit 8 Update 60 Bug Fixes

を下げてやってみましたが無理でした。 ソースファイルを渡さずにgccだけ打つと、fatal error no input files の他に compilation terminated と出るのです.

The following is error log: —– mkdir -p — x86_64-unknown-linux-gnu/libgomp Checking. V’ xgcc: fatal error: no input files compilation terminated. configure:3644: $? = 1 configure:3633: /root/JULY/gcc-4.8.1/build/./

Sep 17, 2012. Install TDM-GCC (the compiler). Make sure that GCC is accessible in PATH. C: >gcc gcc: fatal error: no input files compilation terminated.

. Trouble compiling a.tgz with GCC compiler. gcc: fatal error: no input files compilation terminated../sockstress terminated".

The JRuby community is pleased to announce the release of JRuby 9.1.7.0. Homepage: http://www.jruby.org/ Download: http://www.jruby.org/download

[email protected]:~> gcc hello.c gcc: error: hello.c: No such file or directory gcc: fatal error: no input files compilation terminated. [email protected]:~>.

Changelog Apache 2.4 to be informed that you are up to date

c – Hudson : gcc: fatal error: no input files – Stack Overflow – Hudson : gcc: fatal error: no input files. or directory gcc: fatal error: no input files compilation terminated. ARM GCC with Cygwin on Windows 8.1 : fatal.

hdfeos5 @1.15_3 +openmpi +gcc48 +szip: error: SZIP specified in –with-szlib is. line option '-V' gcc-mp-4.8: fatal error: no input files compilation terminated.

I am trying to run the simple LED blinking model with Simulink and Arduino UNO. However the compilation is failing. As advised I checked a lot of the previous MATLAB threads however I didn’t get a solution.

Autoit If Not @error Then Apr 19, 2017. How to run a task without login using Autoit after reboot of the machine. @ SW_HIDE) If

Error:Configuration Debug The C compiler "C:/MinGW/bin/gcc.exe" is not able to compile a simple test program. It fails with. CMakeTmptestCCompiler.c: No such file or directory gcc.exe: fatal error: no input files compilation.

[email protected]:~$ xenon-gcc xenon-gcc: fatal error: no input. – xenon-gcc: fatal error: no input files. compilation terminated. checking whether we are using the GNU C compiler.

avr-gcc: fatal error: no input files. Learn more about #arduinosimulink Simulink

Port Error Starbound Server Help starbound.server outputs error – I looked through a couple different tutorials and got through port forwarding, but running

and typed msp430-gcc :msp430-gcc: fatal error: no input files compilation terminated. –>This means that path and files are there 🙂 Now to.

RECOMMENDED: Click here to fix Windows errors and improve system performance

This article was written by Antwan